{"text_format":"1","workbook":"xlsx","n_sheets":6,"sheets":["tjekliste","Oversigt økonomi","Tilbudsliste (TBL)","Statistik","Skabelon","dropDowns"],"not_rendered":{"charts":0,"images":0,"macros":1,"external_links":0,"defined_names":1,"comments":2,"pivot_tables":0},"unopened":[],"bounds":{"document_bytes":16777216,"sheet_cells":100000,"rows_first":2000,"rows_last":500,"rows_between":2000,"halvings":0,"cell_chars":16384,"cell_head_chars":4096},"cells_cut":0,"cells_raw":0,"read":"whole","date_system":"1900"}

{"sheet":"tjekliste","index":0,"n_rows":30,"n_cols":16,"rows_kept":30,"cut":false,"hidden":false,"merged":[[3,1,3,15]]}
["Region Midtjylland - Tjekliste"]
[]
[]
["Pulje","xxxxx"]
["Lok. nr.","Adresse","RM sags-behandler","RM sags-behandler initialer","Rådgiver sagsansvarlig ","Rådgivers sagsnr.","Udkast til oplæg sendt til regionen\n[Dato]","Revideret oplæg sendt til regionen\n[dato]","GeoGis - alle felt og analysedata registreret\n[dato]","Indtastet i JAR\n[dato]","Udkast til rapport sendt til regionen\n[dato]","Data overført til jupiter opdateret og analyser godkendt\n[dato]","Endelig rapport sendt til regionen\n[dato]","Boringer sløjfet\n[dato]","GeoGIS sløjfninger og anvendelser opdateret\n[dato]","Jupiter opdateret med sløjfninger\n[dato]"]
["xxx-xxxxx","Lokalitet 1"]
[null,"Lokalitet 2"]
[null,"Lokalitet 3"]
[null,"Lokalitet 4"]
[null,"Lokalitet 5"]
[null,"Lokalitet 6"]
[null,"Lokalitet 7"]
[null,"Lokalitet 8"]
[null,"Lokalitet 9"]
[null,"Lokalitet 10"]
[null,"Lokalitet 11"]
[null,"Lokalitet 12"]
[null,"Lokalitet 13"]
[null,"Lokalitet 14"]
[null,"Lokalitet 15"]
{"$rows_left_out":11}
{"sheet":"Oversigt økonomi","index":1,"n_rows":17,"n_cols":7,"rows_kept":17,"cut":false,"hidden":false,"merged":[]}
["Region Midtjylland - Oversigt økonomi"]
[]
[]
["Pulje",{"$f":"+tjekliste!B4","v":"xxxxx"}]
["Lok. nr.","Adresse","Oprindelig budget1","Planlagt undersøgelse2","Udført undersøgelse3","Faktureret4","Mangler fakturering"]
[{"$f":"LokListe[[#This Row],[Lok. nr.]]","v":"xxx-xxxxx"},{"$f":"LokListe[[#This Row],[Adresse]]","v":"Lokalitet 1"},null,{"$f":"tbhopslag(\"Sum planlagt alle faser:\",\"'\" & A6 & \"'!A1:B300\")","v":0},{"$f":"tbhopslag(\"Sum udført alle:\",\"'\" & A6 & \"'!A1:B300\")","v":0},{"$f":"tbhopslag(\"Sum faktureret alle faser:\",\"'\" & A6 &\"'!A1:B300\")","v":0},{"$f":"oversigt[[#This Row],[Udført undersøgelse3]]-oversigt[[#This Row],[Faktureret4]]","v":0}]
["Sum:",{"$f":"SUBTOTAL(103,oversigt[Adresse])","v":1},{"$f":"SUBTOTAL(109,oversigt[Oprindelig budget1])","v":0},{"$f":"SUBTOTAL(109,oversigt[Planlagt undersøgelse2])","v":0},{"$f":"SUBTOTAL(109,oversigt[Udført undersøgelse3])","v":0},{"$f":"SUBTOTAL(109,oversigt[Faktureret4])","v":0},{"$f":"SUBTOTAL(109,oversigt[Mangler fakturering])","v":0}]
["1 Det budget, der fremkommer ved det reviderede oplæg, indtastes - må ikke rettes efterfølgende"]
["2 Det der planlagt - honorar og udlæg (kopieres direkte over fra tilhørende økonomiskema)"]
["3 Det der reelt er udført - honorar og udlæg (kopieres direkte over fra tilhørende økonomiskema)"]
["4 Faktureret indtil nu - honorar og udlæg (kopieres direkte over fra tilhørende økonomiskema)"]
[]
["Ved fakturering skal fremgå følgende oplysninger"]
["EAN nr. ","579 800 2763 515"]
["Lokalitetsnr.","Fremgår ovenfor af kolonne A"]
["Sagsnavn","Fremgår ovenfor af kolonne B"]
["RM personref.","Initialer fremgår af tjekliste kolonne D"]

{"sheet":"Tilbudsliste (TBL)","index":2,"n_rows":124,"n_cols":14,"rows_kept":124,"cut":false,"hidden":false,"merged":[[10,5,10,6],[2,0,3,4]]}
["Tilbudsliste",null,null,null,null,null,"Årlig prisregulering"]
["Version 1.2",null,null,null,null,null,"Baseret på Danmarks Nettopris indeks oktober / oktober "]
["Tilbudslisten er sammenhængende med kontraktbilag 2 - Opgavebeskrivelse og kravspecifikation, jf. de henviste afsnitsnumre. Her findes en nærmere beskrivelse af de enkelte punkter, hvor det er fundet nødvendigt.",null,null,null,null,null,"https://www.dst.dk/da/Statistik/emner/oekonomi/prisindeks/nettoprisindeks"]
[]
[null,null,null,null,null,null,"Årstal",2022,2023,2024,2025,2026,2027]
[null,null,null,null,null,null,"Oktober [Fra]",null,113.6,{"$f":"I7","v":117.7},{"$f":"J7","v":0},0,0]
[null,null,null,null,null,null,"Oktober [Til]",null,117.7,null,null,null,null,"<- Det er kun nødvendigt at aflæse og indføre dette indeks tal"]
[null,null,null,null,null,null,"Regulering",1,{"$f":"I7/I6","v":1.0360915492957747},{"$f":"J7/J6","v":0},{"$f":"K7/K6","v":{"$error":"#DIV/0!"}},{"$error":"#DIV/0!"},{"$error":"#DIV/0!"}]
[null,null,null,null,"Rådgiver 1 ",null,null,2022,2023,2024,2025,2026,2027]
[null,null,null,null,null,null,null,"Oprindelig tilbudte pris","GÆLDENDE"]
[null,null,null,null,"Rådgiver","Underleverandør",null,"Total","Total","Total","Total","Total","Total"]
["Afsnit","Emne ","Aktivitet","Enhed","Pris (pr. stk)","Pris (pr. stk.)","Navn"]
["Projektstyring og møder"]
["2.1","Projektstyring","Indledende undersøgelser: Planlægning, intern projektstyring og planlægning, økonomistyring og generel kvalitetssikring af de dele, der ikke har individuel kvalitetssikring inkl. Midtpro","Lokalitet",null,null,null,{"$f":"+E14","v":0},{"$f":"H14*$I$8","v":0},{"$f":"I14*$J$8","v":0},{"$f":"J14*$K$8","v":{"$error":"#DIV/0!"}},{"$f":"K14*$L$8","v":{"$error":"#DIV/0!"}},{"$f":"L14*$M$8","v":{"$error":"#DIV/0!"}}]
[null,null,"Videregående undersøgelser: Planlægning, intern projektstyring og planlægning, økonomistyring og generel kvalitetssikring af de dele, der ikke har individuel kvalitetssikring.","Lokalitet pr. fase",null,null,null,{"$f":"+E15","v":0},{"$f":"H15*$I$8","v":0},{"$f":"I15*$J$8","v":0},{"$f":"J15*$K$8","v":{"$error":"#DIV/0!"}},{"$f":"K15*$L$8","v":{"$error":"#DIV/0!"}},{"$f":"L15*$M$8","v":{"$error":"#DIV/0!"}}]
["2.1.4","Møder","Møde med regionen inkl. kørsel, forberedelse og referat.","Møde",null,null,null,{"$f":"+E16","v":0},{"$f":"H16*$I$8","v":0},0,{"$error":"#DIV/0!"},{"$error":"#DIV/0!"},{"$error":"#DIV/0!"}]
[null,null,"Møde med regionen, uden kørsel inkl. forberedelse og referat.","Møde",null,null,null,{"$f":"+E17","v":0},{"$f":"H17*$I$8","v":0},0,{"$error":"#DIV/0!"},{"$error":"#DIV/0!"},{"$error":"#DIV/0!"}]
["Indledende arbejde"]
["3.1",null,"Selvstændig miljøhistorisk redegørelse, interviews, gennemgang af arkiver.","Lokalitet",null,null,null,{"$f":"+E19","v":0},{"$f":"H19*$I$8","v":0},0,{"$error":"#DIV/0!"},{"$error":"#DIV/0!"},{"$error":"#DIV/0!"}]
[null,null,"Selvstændig miljøhistorisk redegørelse, interviews, gennemgang af arkiver og besigtigelse. ","Lokalitet",null,null,null,0,{"$f":"H20*$I$8","v":0},0,{"$error":"#DIV/0!"},{"$error":"#DIV/0!"},{"$error":"#DIV/0!"}]
{"$rows_left_out":105}
{"sheet":"Statistik","index":3,"n_rows":127,"n_cols":7,"rows_kept":127,"cut":false,"hidden":false,"merged":[[3,5,3,6],[2,5,2,6]]}
["Region Midtjylland - Økonomiskema"]
[]
[null,null,null,null,null,"Sum pulje"]
[]
["Afsnit","Emne ","Aktivitet","Enhed",null,"Antal","Sum\n[Kr.]"]
["Projektstyring og møder",null,null,null,{"$error":"#REF!"},{"$f":"+SUM(F7:F10)","v":{"$error":"#REF!"}},{"$f":"+SUM(G7:G10)","v":{"$error":"#REF!"}}]
["2.1","Projektstyring","Indledende undersøgelser: Planlægning, intern projektstyring og planlægning, økonomistyring og generel kvalitetssikring af de dele, der ikke har individuel kvalitetssikring inkl. Midtpro","Lokalitet",null,{"$f":" +#REF!","v":{"$error":"#REF!"}},{"$f":" +#REF!","v":{"$error":"#REF!"}}]
[null,null,"Videregående undersøgelser: Planlægning, intern projektstyring og planlægning, økonomistyring og generel kvalitetssikring af de dele, der ikke har individuel kvalitetssikring.","Lokalitet pr. fase",null,{"$f":" +#REF!","v":{"$error":"#REF!"}},{"$f":" +#REF!","v":{"$error":"#REF!"}}]
["2.1.4","Møder","Møde med regionen inkl. kørsel, forberedelse og referat.","Møde",null,{"$f":" +#REF!","v":{"$error":"#REF!"}},{"$f":" +#REF!","v":{"$error":"#REF!"}}]
[null,null,"Møde med regionen, uden kørsel inkl. forberedelse og referat.","Møde",null,{"$f":" +#REF!","v":{"$error":"#REF!"}},{"$f":" +#REF!","v":{"$error":"#REF!"}}]
["Indledende arbejde",null,null,null,null,{"$f":" +#REF!","v":{"$error":"#REF!"}},{"$f":"+SUM(G12:G18)","v":{"$error":"#REF!"}}]
["3.1",null,"Selvstændig miljøhistorisk redegørelse, interviews, gennemgang af arkiver.","Lokalitet",null,{"$f":" +#REF!","v":{"$error":"#REF!"}},{"$f":" +#REF!","v":{"$error":"#REF!"}}]
[null,null,"Selvstændig miljøhistorisk redegørelse, interviews, gennemgang af arkiver og besigtigelse. ","Lokalitet",null,{"$f":" +#REF!","v":{"$error":"#REF!"}},{"$f":" +#REF!","v":{"$error":"#REF!"}}]
["3.2",null,"Miljøhistorisk redegørelse med forventet undersøgelse, interviews, gennemgang af arkiver, besigtigelse.","Lokalitet",null,{"$f":" +#REF!","v":{"$error":"#REF!"}},{"$f":" +#REF!","v":{"$error":"#REF!"}}]
["3.3",null,"Besigtigelse og interviews.","Lokalitet",null,{"$f":" +#REF!","v":{"$error":"#REF!"}},{"$f":" +#REF!","v":{"$error":"#REF!"}}]
["3.4",null,"Opstartgebyr for hvilende sag.","Lokalitet",null,{"$f":" +#REF!","v":{"$error":"#REF!"}},{"$f":" +#REF!","v":{"$error":"#REF!"}}]
["3.5",null,"Udarbejdelse af undersøgelsesoplæg, indledende undersøgelse inkl. arbejdsinstruks.","Lokalitet",null,{"$f":" +#REF!","v":{"$error":"#REF!"}},{"$f":" +#REF!","v":{"$error":"#REF!"}}]
["3.6",null,"Udarbejdelse af undersøgelsesoplæg, videregående undersøgelse inkl. arbejdsinstruks.","Lokalitet",null,{"$f":" +#REF!","v":{"$error":"#REF!"}},{"$f":" +#REF!","v":{"$error":"#REF!"}}]
["Borearbejde",null,null,null,null,{"$f":" +#REF!","v":{"$error":"#REF!"}},{"$f":"+SUM(G20:G67)","v":{"$error":"#REF!"}}]
["4.2","Feltforberedelse","Mobilisering til feltarbejde.","Fase",null,{"$f":" +#REF!","v":{"$error":"#REF!"}},{"$f":" +#REF!","v":{"$error":"#REF!"}}]
{"$rows_left_out":108}
{"sheet":"Skabelon","index":4,"n_rows":211,"n_cols":45,"rows_kept":211,"cut":false,"hidden":true,"merged":[[2,43,2,44],[3,43,3,44],[2,0,2,1],[3,0,3,1],[3,8,3,9],[3,10,3,11],[3,12,3,13],[3,14,3,15],[3,22,3,23],[3,26,3,27],[3,28,3,29],[3,30,3,31],[3,32,3,33],[2,7,2,23],[2,25,2,41],[3,3,3,4],[3,40,3,41],[131,7,132,7],[131,8,131,9],[131,10,131,11],[131,12,131,13],[131,14,131,15],[131,40,131,41],[131,25,132,25],[131,26,131,27],[131,28,131,29],[131,30,131,31],[131,32,131,33],[3,16,3,17],[3,18,3,19],[3,20,3,21],[3,34,3,35],[3,36,3,37],[3,38,3,39],[131,16,131,17],[131,18,131,19],[131,20,131,21],[131,34,131,35],[131,36,131,37],[131,38,131,39],[131,22,131,23]]}
[null,null,null,"Region Midtjylland - Økonomiskema"]
[null,null,null,{"$f":"tjekliste!A6","v":"xxx-xxxxx"},{"$f":"+tjekliste!B6","v":"Lokalitet 1"},null,null,2023,"<- Vælg udførelsesårstal for fase",null,null,null,null,null,null,null,null,null,null,null,null,null,null,null,null,2023,"<- Vælg udførelsesårstal for fase"]
["Statistik",null,null,null,null,null,null,"1. fase",null,null,null,null,null,null,null,null,null,null,null,null,null,null,null,null,null,"2. fase",null,null,null,null,null,null,null,null,null,null,null,null,null,null,null,null,null,"Statistik"]
["Sum Udført\nalle faser",null,null,"Vejledning se her",null,null,null,"Pris (pr. stk)","Planlagt undersøgelse",null,"Udført måned",null,"Udført måned",null,"Udført måned",null,"Udført måned",null,"Udført måned",null,"Udført måned",null,"Sum Udført",null,null,"Pris (pr. stk)","Planlagt undersøgelse",null,"Udført måned",null,"Udført måned",null,"Udført måned",null,"Udført måned",null,"Udført måned",null,"Udført måned",null,"Sum Udført",null,null,"Sum Udført\nalle faser"]
["Antal","Sum\n[Kr.]",null,"Afsnit","Emne ","Aktivitet","Enhed","[Kr.]","Antal","Sum","Antal","Sum","Antal","Sum","Antal","Sum","Antal","Sum","Antal","Sum","Antal","Sum","Antal","Sum",null,"[Kr.]","Antal","Sum","Antal","Sum","Antal","Sum","Antal","Sum","Antal","Sum","Antal","Sum","Antal","Sum","Antal","Sum",null,"Antal","Sum\n[Kr.]"]
[null,{"$f":"+SUM(B7:B10)","v":0},null,"Projektstyring og møder",null,null,null,null,null,{"$f":"+SUM(J7:J10)","v":0},null,{"$f":"+SUM(L7:L10)","v":0},null,{"$f":"+SUM(N7:N10)","v":0},null,{"$f":"+SUM(P7:P10)","v":0},null,{"$f":"+SUM(R7:R10)","v":0},null,{"$f":"+SUM(T7:T10)","v":0},null,{"$f":"+SUM(V7:V10)","v":0},null,{"$f":"+SUM(X7:X10)","v":0},null,null,null,{"$f":"+SUM(AB7:AB10)","v":0},null,{"$f":"+SUM(AD7:AD10)","v":0},null,{"$f":"+SUM(AF7:AF10)","v":0},null,{"$f":"+SUM(AH7:AH10)","v":0},null,{"$f":"+SUM(AJ7:AJ10)","v":0},null,{"$f":"+SUM(AL7:AL10)","v":0},null,{"$f":"+SUM(AN7:AN10)","v":0},null,{"$f":"+SUM(AP7:AP10)","v":0},null,null,{"$f":"B6","v":0}]
[{"$f":"SUMIFS(I7:HC7,$I$5:$HC$5,\"Antal\",$I$4:$HC$4,\"Sum Udført\")","v":0},{"$f":"SUMIFS(I7:HC7,$I$5:$HC$5,\"Sum\",$H$4:$HB$4,\"Sum Udført\")","v":0},null,"2.1","Projektstyring","Indledende undersøgelser: Planlægning, intern projektstyring og planlægning, økonomistyring og generel kvalitetssikring af de dele, der ikke har individuel kvalitetssikring inkl. Midtpro","Lokalitet",{"$f":"INDEX('Tilbudsliste (TBL)'!$I14:$M14,MATCH(H$2,'Tilbudsliste (TBL)'!$I$9:$M$9,0))","v":0},null,{"$f":"+H7*I7","v":0},null,{"$f":"+H7*K7","v":0},null,{"$f":"+H7*M7","v":0},null,{"$f":"+H7*O7","v":0},null,{"$f":"+H7*Q7","v":0},null,{"$f":"+H7*S7","v":0},null,{"$f":"+H7*U7","v":0},{"$f":"K7+M7+O7+Q7+S7+U7","v":0},{"$f":"+L7+N7+P7+R7+T7+V7","v":0},null,{"$f":"INDEX('Tilbudsliste (TBL)'!$I14:$M14,MATCH(Z$2,'Tilbudsliste (TBL)'!$I$9:$M$9,0))","v":0},null,{"$f":"+Z7*AA7","v":0},null,{"$f":"+Z7*AC7","v":0},null,{"$f":"+Z7*AE7","v":0},null,{"$f":"+Z7*AG7","v":0},null,{"$f":"+Z7*AI7","v":0},null,{"$f":"+Z7*AK7","v":0},null,{"$f":"+Z7*AM7","v":0},{"$f":"+AC7+AE7+AG7+AI7+AK7+AM7","v":0},{"$f":"+AD7+AF7+AH7+AJ7+AL7+AN7","v":0},null,{"$f":"A7","v":0},0]
[{"$f":"SUMIFS(I8:HC8,$I$5:$HC$5,\"Antal\",$I$4:$HC$4,\"Sum Udført\")","v":0},{"$f":"SUMIFS(I8:HC8,$I$5:$HC$5,\"Sum\",$H$4:$HB$4,\"Sum Udført\")","v":0},null,null,null,"Videregående undersøgelser: Planlægning, intern projektstyring og planlægning, økonomistyring og generel kvalitetssikring af de dele, der ikke har individuel kvalitetssikring.","Lokalitet pr. fase",{"$f":"INDEX('Tilbudsliste (TBL)'!$I15:$M15,MATCH(H$2,'Tilbudsliste (TBL)'!$I$9:$M$9,0))","v":0},null,{"$f":"+H8*I8","v":0},null,{"$f":"+H8*K8","v":0},null,{"$f":"+H8*M8","v":0},null,{"$f":"+H8*O8","v":0},null,{"$f":"+H8*Q8","v":0},null,{"$f":"+H8*S8","v":0},null,{"$f":"+H8*U8","v":0},{"$f":"K8+M8+O8+Q8+S8+U8","v":0},{"$f":"+L8+N8+P8+R8+T8+V8","v":0},null,{"$f":"INDEX('Tilbudsliste (TBL)'!$I15:$M15,MATCH($Z$2,'Tilbudsliste (TBL)'!$I$9:$M$9,0))","v":0},null,{"$f":"+Z8*AA8","v":0},null,{"$f":"+Z8*AC8","v":0},null,{"$f":"+Z8*AE8","v":0},null,{"$f":"+Z8*AG8","v":0},null,{"$f":"+Z8*AI8","v":0},null,{"$f":"+Z8*AK8","v":0},null,{"$f":"+Z8*AM8","v":0},{"$f":"+AC8+AE8+AG8+AI8+AK8+AM8","v":0},{"$f":"+AD8+AF8+AH8+AJ8+AL8+AN8","v":0},null,{"$f":"A8","v":0},0]
[{"$f":"SUMIFS(I9:HC9,$I$5:$HC$5,\"Antal\",$I$4:$HC$4,\"Sum Udført\")","v":0},{"$f":"SUMIFS(I9:HC9,$I$5:$HC$5,\"Sum\",$H$4:$HB$4,\"Sum Udført\")","v":0},null,"2.1.4","Møder","Møde med regionen inkl. kørsel, forberedelse og referat.","Møde",{"$f":"INDEX('Tilbudsliste (TBL)'!$I16:$M16,MATCH(H$2,'Tilbudsliste (TBL)'!$I$9:$M$9,0))","v":0},null,0,null,0,null,0,null,0,null,0,null,0,null,0,0,{"$f":"+L9+N9+P9+R9+T9+V9","v":0},null,{"$f":"INDEX('Tilbudsliste (TBL)'!$I16:$M16,MATCH($Z$2,'Tilbudsliste (TBL)'!$I$9:$M$9,0))","v":0},null,0,null,0,null,0,null,0,null,0,null,0,null,0,{"$f":"+AC9+AE9+AG9+AI9+AK9+AM9","v":0},{"$f":"+AD9+AF9+AH9+AJ9+AL9+AN9","v":0},null,{"$f":"A9","v":0},0]
[{"$f":"SUMIFS(I10:HC10,$I$5:$HC$5,\"Antal\",$I$4:$HC$4,\"Sum Udført\")","v":0},{"$f":"SUMIFS(I10:HC10,$I$5:$HC$5,\"Sum\",$H$4:$HB$4,\"Sum Udført\")","v":0},null,null,null,"Møde med regionen, uden kørsel inkl. forberedelse og referat.","Møde",{"$f":"INDEX('Tilbudsliste (TBL)'!$I17:$M17,MATCH(H$2,'Tilbudsliste (TBL)'!$I$9:$M$9,0))","v":0},null,0,null,0,null,0,null,0,null,0,null,0,null,0,0,{"$f":"+L10+N10+P10+R10+T10+V10","v":0},null,{"$f":"INDEX('Tilbudsliste (TBL)'!$I17:$M17,MATCH($Z$2,'Tilbudsliste (TBL)'!$I$9:$M$9,0))","v":0},null,0,null,0,null,0,null,0,null,0,null,0,null,0,0,{"$f":"+AD10+AF10+AH10+AJ10+AL10+AN10","v":0},null,{"$f":"A10","v":0},0]
[null,{"$f":"+SUM(B12:B18)","v":0},null,"Indledende arbejde",null,null,null,null,null,{"$f":"+SUM(J12:J18)","v":0},null,{"$f":"+SUM(L12:L18)","v":0},null,{"$f":"+SUM(N12:N18)","v":0},null,{"$f":"+SUM(P12:P18)","v":0},null,{"$f":"+SUM(R12:R18)","v":0},null,{"$f":"+SUM(T12:T18)","v":0},null,{"$f":"+SUM(V12:V18)","v":0},{"$f":"K11+M11+O11+Q11+S11+U11","v":0},{"$f":"+SUM(X12:X18)","v":0},null,null,null,{"$f":"+SUM(AB12:AB18)","v":0},null,{"$f":"+SUM(AD12:AD18)","v":0},null,{"$f":"+SUM(AF12:AF18)","v":0},null,{"$f":"+SUM(AH12:AH18)","v":0},null,{"$f":"+SUM(AJ12:AJ18)","v":0},null,{"$f":"+SUM(AL12:AL18)","v":0},null,{"$f":"+SUM(AN12:AN18)","v":0},null,{"$f":"+SUM(AP12:AP18)","v":0},null,null,0]
[{"$f":"SUMIFS(I12:HC12,$I$5:$HC$5,\"Antal\",$I$4:$HC$4,\"Sum Udført\")","v":0},{"$f":"SUMIFS(I12:HC12,$I$5:$HC$5,\"Sum\",$H$4:$HB$4,\"Sum Udført\")","v":0},null,"3.1",null,"Selvstændig miljøhistorisk redegørelse, interviews, gennemgang af arkiver.","Lokalitet",{"$f":"INDEX('Tilbudsliste (TBL)'!$I19:$M19,MATCH(H$2,'Tilbudsliste (TBL)'!$I$9:$M$9,0))","v":0},null,{"$f":"+H12*I12","v":0},null,0,null,0,null,0,null,0,null,0,null,0,0,{"$f":"+L12+N12+P12+R12+T12+V12","v":0},null,{"$f":"INDEX('Tilbudsliste (TBL)'!$I19:$M19,MATCH($Z$2,'Tilbudsliste (TBL)'!$I$9:$M$9,0))","v":0},null,{"$f":"+Z12*AA12","v":0},null,{"$f":"+Z12*AC12","v":0},null,{"$f":"+Z12*AE12","v":0},null,{"$f":"+Z12*AG12","v":0},null,{"$f":"+Z12*AI12","v":0},null,{"$f":"+Z12*AK12","v":0},null,{"$f":"+Z12*AM12","v":0},{"$f":"+AC12+AE12+AG12+AI12+AK12+AM12","v":0},{"$f":"+AD12+AF12+AH12+AJ12+AL12+AN12","v":0},null,{"$f":"A12","v":0},0]
[0,0,null,null,null,"Selvstændig miljøhistorisk redegørelse, interviews, gennemgang af arkiver og besigtigelse. ","Lokalitet",{"$f":"INDEX('Tilbudsliste (TBL)'!$I20:$M20,MATCH(H$2,'Tilbudsliste (TBL)'!$I$9:$M$9,0))","v":0},null,0,null,0,null,0,null,0,null,0,null,0,null,0,0,0,null,{"$f":"INDEX('Tilbudsliste (TBL)'!$I20:$M20,MATCH($Z$2,'Tilbudsliste (TBL)'!$I$9:$M$9,0))","v":0},null,0,null,0,null,0,null,0,null,0,null,0,null,0,0,0,null,0,0]
[0,0,null,"3.2",null,"Miljøhistorisk redegørelse med forventet undersøgelse, interviews, gennemgang af arkiver, besigtigelse.","Lokalitet",{"$f":"INDEX('Tilbudsliste (TBL)'!$I21:$M21,MATCH(H$2,'Tilbudsliste (TBL)'!$I$9:$M$9,0))","v":0},null,0,null,0,null,0,null,0,null,0,null,0,null,0,0,{"$f":"+L14+N14+P14+R14+T14+V14","v":0},null,{"$f":"INDEX('Tilbudsliste (TBL)'!$I21:$M21,MATCH($Z$2,'Tilbudsliste (TBL)'!$I$9:$M$9,0))","v":0},null,0,null,0,null,0,null,0,null,0,null,0,null,0,0,{"$f":"+AD14+AF14+AH14+AJ14+AL14+AN14","v":0},null,0,0]
[0,0,null,"3.3",null,"Besigtigelse og interviews.","Lokalitet",{"$f":"INDEX('Tilbudsliste (TBL)'!$I22:$M22,MATCH(H$2,'Tilbudsliste (TBL)'!$I$9:$M$9,0))","v":0},null,0,null,0,null,0,null,0,null,0,null,0,null,0,0,{"$f":"+L15+N15+P15+R15+T15+V15","v":0},null,{"$f":"INDEX('Tilbudsliste (TBL)'!$I22:$M22,MATCH($Z$2,'Tilbudsliste (TBL)'!$I$9:$M$9,0))","v":0},null,0,null,0,null,0,null,0,null,0,null,0,null,0,0,{"$f":"+AD15+AF15+AH15+AJ15+AL15+AN15","v":0},null,0,0]
[0,0,null,"3.4",null,"Opstartgebyr for hvilende sag.","Lokalitet",{"$f":"INDEX('Tilbudsliste (TBL)'!$I23:$M23,MATCH(H$2,'Tilbudsliste (TBL)'!$I$9:$M$9,0))","v":0},null,0,null,0,null,0,null,0,null,0,null,0,null,0,0,0,null,{"$f":"INDEX('Tilbudsliste (TBL)'!$I23:$M23,MATCH($Z$2,'Tilbudsliste (TBL)'!$I$9:$M$9,0))","v":0},null,0,null,0,null,0,null,0,null,0,null,0,null,0,0,{"$f":"+AD16+AF16+AH16+AJ16+AL16+AN16","v":0},null,0,0]
[0,0,null,"3.5",null,"Udarbejdelse af undersøgelsesoplæg, indledende undersøgelse inkl. arbejdsinstruks.","Lokalitet",{"$f":"INDEX('Tilbudsliste (TBL)'!$I24:$M24,MATCH(H$2,'Tilbudsliste (TBL)'!$I$9:$M$9,0))","v":0},null,0,null,0,null,0,null,0,null,0,null,0,null,0,0,0,null,{"$f":"INDEX('Tilbudsliste (TBL)'!$I24:$M24,MATCH($Z$2,'Tilbudsliste (TBL)'!$I$9:$M$9,0))","v":0},null,0,null,0,null,0,null,0,null,0,null,0,null,0,0,0,null,0,0]
[0,0,null,"3.6",null,"Udarbejdelse af undersøgelsesoplæg, videregående undersøgelse inkl. arbejdsinstruks.","Lokalitet",{"$f":"INDEX('Tilbudsliste (TBL)'!$I25:$M25,MATCH(H$2,'Tilbudsliste (TBL)'!$I$9:$M$9,0))","v":0},null,0,null,0,null,0,null,0,null,0,null,0,null,0,0,0,null,{"$f":"INDEX('Tilbudsliste (TBL)'!$I25:$M25,MATCH($Z$2,'Tilbudsliste (TBL)'!$I$9:$M$9,0))","v":0},null,0,null,0,null,0,null,0,null,0,null,0,null,0,0,0,null,0,0]
[null,{"$f":"+SUM(B20:B67)","v":0},null,"Borearbejde",null,null,null,null,null,{"$f":"+SUM(J20:J67)","v":0},null,{"$f":"+SUM(L20:L67)","v":0},null,{"$f":"+SUM(N20:N67)","v":0},null,{"$f":"+SUM(P20:P67)","v":0},null,{"$f":"+SUM(R20:R67)","v":0},null,{"$f":"+SUM(T20:T67)","v":0},null,{"$f":"+SUM(V20:V67)","v":0},{"$f":"K19+M19+O19+Q19+S19+U19","v":0},{"$f":"+SUM(X20:X67)","v":0},null,null,null,{"$f":"+SUM(AB20:AB67)","v":0},null,{"$f":"+SUM(AD20:AD67)","v":0},null,{"$f":"+SUM(AF20:AF67)","v":0},null,{"$f":"+SUM(AH20:AH67)","v":0},null,{"$f":"+SUM(AJ20:AJ67)","v":0},null,{"$f":"+SUM(AL20:AL67)","v":0},null,{"$f":"+SUM(AN20:AN67)","v":0},null,{"$f":"+SUM(AP20:AP67)","v":0},null,null,0]
[{"$f":"SUMIFS(I20:HC20,$I$5:$HC$5,\"Antal\",$I$4:$HC$4,\"Sum Udført\")","v":0},{"$f":"SUMIFS(I20:HC20,$I$5:$HC$5,\"Sum\",$H$4:$HB$4,\"Sum Udført\")","v":0},null,"4.2","Feltforberedelse","Mobilisering til feltarbejde.","Fase",{"$f":"INDEX('Tilbudsliste (TBL)'!$I27:$M27,MATCH(H$2,'Tilbudsliste (TBL)'!$I$9:$M$9,0))","v":0},null,0,null,0,null,0,null,0,null,0,null,0,null,0,0,0,null,{"$f":"INDEX('Tilbudsliste (TBL)'!$I27:$M27,MATCH($Z$2,'Tilbudsliste (TBL)'!$I$9:$M$9,0))","v":0},null,{"$f":"+Z20*AA20","v":0},null,{"$f":"+Z20*AC20","v":0},null,{"$f":"+Z20*AE20","v":0},null,{"$f":"+Z20*AG20","v":0},null,{"$f":"+Z20*AI20","v":0},null,{"$f":"+Z20*AK20","v":0},null,{"$f":"+Z20*AM20","v":0},{"$f":"+AC20+AE20+AG20+AI20+AK20+AM20","v":0},{"$f":"+AD20+AF20+AH20+AJ20+AL20+AN20","v":0},null,{"$f":"A20","v":0},0]
{"$rows_left_out":192}
{"sheet":"dropDowns","index":5,"n_rows":7,"n_cols":2,"rows_kept":7,"cut":false,"hidden":true,"merged":[]}
[]
[null,"Drop down Årstal"]
[null,2023]
[null,2024]
[null,2025]
[null,2026]
[null,2027]